BDBM302686 N5-(Benzo[d]thiazol- 6-yl)-2-(3-chloro-4- methylphenyl)-6,7- dihydropyrazolo[1,5-a] pyrazine-3,5(4H)- dicarboxamide::US9598423, Example 254
SMILES Cc1ccc(cc1Cl)-c1nn2CCN(Cc2c1C(N)=O)C(=O)Nc1ccc2ncsc2c1
InChI Key InChIKey=IZORYSUFIJFULY-UHFFFAOYSA-N
Data  2 IC50
  Tab Delimited (TSV)   2D SDfile   Computed 3D by Vconf -m prep SDfile
Find this compound or compounds like it in BindingDB:
Activity Spreadsheet -- Enzyme Inhibition Constant Data from BindingDB
Found 2 hits for monomerid = 302686
TargetCasein kinase I isoform delta(Homo sapiens (Human))
Bristol-Myers Squibb
US Patent
LigandPNGBDBM302686(N5-(Benzo[d]thiazol- 6-yl)-2-(3-chloro-4- methylph...)
Affinity DataIC50: <10nM. Assay description: The kinase assay was performed in V-bottom 384-well plates. The final assay volume was 30 μl prepared from 15 μl additions of enzyme, subst...
Ligand InfoPC cidPC sid
In DepthDetails US Patent
TargetCasein kinase I isoform epsilon(Homo sapiens (Human))
Bristol-Myers Squibb
US Patent
LigandPNGBDBM302686(N5-(Benzo[d]thiazol- 6-yl)-2-(3-chloro-4- methylph...)
Affinity DataIC50: <10nM. Assay description: The kinase assay was performed in V-bottom 384-well plates. The final assay volume was 30 μl prepared from 15 μl additions of enzyme, subst...
Ligand InfoPC cidPC sid
In DepthDetails US Patent