BDBM302697 US9598423, Example 265
SMILES CN(C)c1cc(Cl)cc(c1)-c1nn2CCN(Cc2c1C(N)=O)C(=O)Nc1ccc(cc1)[N+]#[C-]
InChI Key InChIKey=OGIJZIZLHGIHSZ-UHFFFAOYSA-N
Data  1 IC50
  Tab Delimited (TSV)   2D SDfile   Computed 3D by Vconf -m prep SDfile
Find this compound or compounds like it in BindingDB:
Activity Spreadsheet -- Enzyme Inhibition Constant Data from BindingDB
Found 1 hit for monomerid = 302697
TargetCasein kinase I isoform epsilon(Homo sapiens (Human))
Bristol-Myers Squibb
US Patent
LigandPNGBDBM302697(US9598423, Example 265)
Affinity DataIC50: <10nM. Assay description: The kinase assay was performed in V-bottom 384-well plates. The final assay volume was 30 μl prepared from 15 μl additions of enzyme, subst...
Ligand InfoPC cidPC sid
In DepthDetails US Patent