BDBM30271 carboline analog, 83
SMILES CC1CNC(=O)c2[nH]c3ccc(cc3c12)C(=O)Nc1nc(cs1)C(=O)NC1CCCCC1
InChI Key InChIKey=WIVODQGHXOFCFL-UHFFFAOYSA-N
Data  1 IC50
  Tab Delimited (TSV)   2D SDfile   Computed 3D by Vconf -m prep SDfile
Find this compound or compounds like it in BindingDB:
Activity Spreadsheet -- Enzyme Inhibition Constant Data from BindingDB
Found 1 hit for monomerid = 30271
TargetMAP kinase-activated protein kinase 2 [41-364](Homo sapiens (Human))
Boehringer Ingelheim Pharmaceuticals
LigandPNGBDBM30271(carboline analog, 83)
Affinity DataIC50:  44nM. Assay description: Diluted compounds and activated GST-MK2 were incubated in neutravidin coated plates (Pierce) in reaction buffer containing biotinylated GST-LSP1 and ...
In DepthDetails ArticlePubMed