BDBM302836 2-(3-Chloro-4-fluorophenyl)-N5-(4-cyanophenyl)-7-(2-hydroxyethyl)-6,7-dihydropyrazolo[1,5-a]pyrazine-3,5(4H)-dicarboxamide::US9598423, Example A66
SMILES NC(=O)c1c2CN(C[C@@H](CCO)n2nc1-c1ccc(F)c(Cl)c1)C(=O)Nc1ccc(cc1)C#N
InChI Key InChIKey=GBLPWVCKRGXNIA-MRXNPFEDSA-N
Data  1 IC50
  Tab Delimited (TSV)   2D SDfile   Computed 3D by Vconf -m prep SDfile
Find this compound or compounds like it in BindingDB:
Activity Spreadsheet -- Enzyme Inhibition Constant Data from BindingDB
Found 1 hit for monomerid = 302836
TargetCasein kinase I isoform delta(Homo sapiens (Human))
Bristol-Myers Squibb
US Patent
LigandPNGBDBM302836(2-(3-Chloro-4-fluorophenyl)-N5-(4-cyanophenyl)-7-(...)
Affinity DataIC50: <10nM. Assay description: The kinase assay was performed in V-bottom 384-well plates. The final assay volume was 30 μl prepared from 15 μl additions of enzyme, subst...
Ligand InfoPC cidPC sid
In DepthDetails US Patent