BDBM302875 US9598440, 12
SMILES OC[C@H]1C[C@@H](Nc2nc(NC3COC3)ncc2-c2nc3ccccc3s2)[C@H](O)[C@@H]1O
InChI Key InChIKey=AIOBPPYMWYLRBH-AIPUMIGSSA-N
Data  1 IC50
  Tab Delimited (TSV)   2D SDfile   Computed 3D by Vconf -m prep SDfile
Find this compound or compounds like it in BindingDB:
Activity Spreadsheet -- Enzyme Inhibition Constant Data from BindingDB
Found 1 hit for monomerid = 302875
TargetInterleukin-1 receptor-associated kinase 4(Homo sapiens (Human))
Merck Sharp & Dohme
US Patent
LigandPNGBDBM302875(US9598440, 12)
Affinity DataIC50:  236nM. Assay description: Procedure: A 20 μl reaction mixture contains 10 mM TriHCl, pH 7.2, 0.5 nM GST tagged IRAK4 (SignalChem), 100 nM fluorescent peptide substrate (R...
Ligand InfoPC cidPC sid
In DepthDetails US Patent