BDBM302905 US9598440, 43
SMILES COc1ccc(Nc2ncc(-c3nc4ccccc4s3)c(N[C@@H]3C[C@H](CO)[C@@H](O)[C@H]3O)n2)cn1
InChI Key InChIKey=DUFYBMXFXAKUFM-KRVNLHHGSA-N
Data  1 IC50
  Tab Delimited (TSV)   2D SDfile   Computed 3D by Vconf -m prep SDfile
Find this compound or compounds like it in BindingDB:
Activity Spreadsheet -- Enzyme Inhibition Constant Data from BindingDB
Found 1 hit for monomerid = 302905
TargetInterleukin-1 receptor-associated kinase 4(Homo sapiens (Human))
Merck Sharp & Dohme
US Patent
LigandPNGBDBM302905(US9598440, 43)
Affinity DataIC50:  8.20nM. Assay description: Procedure: A 20 μl reaction mixture contains 10 mM TriHCl, pH 7.2, 0.5 nM GST tagged IRAK4 (SignalChem), 100 nM fluorescent peptide substrate (R...
Ligand InfoPC cidPC sid
In DepthDetails US Patent