BDBM302947 US9598440, 85
SMILES Cc1cc(Nc2ncc(c(N[C@@H]3C[C@H](CO)[C@@H](O)[C@H]3O)[nH+]2)-n2cccn2)cc(C)n1
InChI Key InChIKey=RGNKXANHJKNZRL-UWIFEVILSA-O
Data  1 IC50
  Tab Delimited (TSV)   2D SDfile   Computed 3D by Vconf -m prep SDfile
Find this compound or compounds like it in BindingDB:
Activity Spreadsheet -- Enzyme Inhibition Constant Data from BindingDB
Found 1 hit for monomerid = 302947
TargetInterleukin-1 receptor-associated kinase 4(Homo sapiens (Human))
Merck Sharp & Dohme
US Patent
LigandPNGBDBM302947(US9598440, 85)
Affinity DataIC50:  932nM. Assay description: Procedure: A 20 μl reaction mixture contains 10 mM TriHCl, pH 7.2, 0.5 nM GST tagged IRAK4 (SignalChem), 100 nM fluorescent peptide substrate (R...
Ligand InfoPC cidPC sid
In DepthDetails US Patent