BDBM302975 US9598440, 116
SMILES CC(C)Oc1cc(Nc2ncc(-c3nc4ccccc4s3)c(N[C@@H]3C[C@@H]([C@@H](O)[C@H]3O)C(C)(C)O)[nH+]2)ccn1
InChI Key InChIKey=UNXJCCGJQRGXQF-RECSWBGYSA-O
Data  1 IC50
  Tab Delimited (TSV)   2D SDfile   Computed 3D by Vconf -m prep SDfile
Find this compound or compounds like it in BindingDB:
Activity Spreadsheet -- Enzyme Inhibition Constant Data from BindingDB
Found 1 hit for monomerid = 302975
TargetInterleukin-1 receptor-associated kinase 4(Homo sapiens (Human))
Merck Sharp & Dohme
US Patent
LigandPNGBDBM302975(US9598440, 116)
Affinity DataIC50:  19nM. Assay description: Procedure: A 20 μl reaction mixture contains 10 mM TriHCl, pH 7.2, 0.5 nM GST tagged IRAK4 (SignalChem), 100 nM fluorescent peptide substrate (R...
Ligand InfoPC cidPC sid
In DepthDetails US Patent