BDBM303000 US9598440, 141
SMILES CO[C@H]1[C@@H](C[C@H](CO)[C@H]1O)Nc1nc(Nc2ccnc(OC)c2)ncc1-c1ccc2ccccc2n1
InChI Key InChIKey=NUEVNWXEMSOLBN-LNDODUDPSA-N
Data  1 IC50
  Tab Delimited (TSV)   2D SDfile   Computed 3D by Vconf -m prep SDfile
Find this compound or compounds like it in BindingDB:
Activity Spreadsheet -- Enzyme Inhibition Constant Data from BindingDB
Found 1 hit for monomerid = 303000
TargetInterleukin-1 receptor-associated kinase 4(Homo sapiens (Human))
Merck Sharp & Dohme
US Patent
LigandPNGBDBM303000(US9598440, 141)
Affinity DataIC50:  33nM. Assay description: Procedure: A 20 μl reaction mixture contains 10 mM TriHCl, pH 7.2, 0.5 nM GST tagged IRAK4 (SignalChem), 100 nM fluorescent peptide substrate (R...
Ligand InfoPC cidPC sid
In DepthDetails US Patent