BDBM303007 US9598440, 148
SMILES CO[C@H]1[C@@H](C[C@@H]([C@H]1O)C(=O)OC)Nc1nc(Nc2cc(C)nc(C)c2)ncc1-c1nc2ccccc2s1
InChI Key InChIKey=HJYODLMYFLERCO-MQYXYMALSA-N
Data  1 IC50
  Tab Delimited (TSV)   2D SDfile   Computed 3D by Vconf -m prep SDfile
Find this compound or compounds like it in BindingDB:
Activity Spreadsheet -- Enzyme Inhibition Constant Data from BindingDB
Found 1 hit for monomerid = 303007
TargetInterleukin-1 receptor-associated kinase 4(Homo sapiens (Human))
Merck Sharp & Dohme
US Patent
LigandPNGBDBM303007(US9598440, 148)
Affinity DataIC50:  2.10nM. Assay description: Procedure: A 20 μl reaction mixture contains 10 mM TriHCl, pH 7.2, 0.5 nM GST tagged IRAK4 (SignalChem), 100 nM fluorescent peptide substrate (R...
Ligand InfoPC cidPC sid
In DepthDetails US Patent