BDBM303012 (2S,4R)-1-(2-(3- acetyl-5-(pyrimidin-5- ylamino)-1H-indol-1- yl)acetyl)-N-(2,2- dimethyl-2,3- dihydrobenzofuran-7- yl)-4- fluoropyrrolidine-2- carboxamide::US10660876, Cmpd No. 24::US9598446, Compound 24
SMILES CC(=O)c1cn(CC(=O)N2C[C@H](F)C[C@H]2C(=O)Nc2cccc3CC(C)(C)Oc23)c2ccc(Nc3cncnc3)cc12
InChI Key InChIKey=WZHHICLBIJGXRJ-HRFSGMKKSA-N
Data  2 IC50
  Tab Delimited (TSV)   2D SDfile   Computed 3D by Vconf -m prep SDfile
Find this compound or compounds like it in BindingDB:
Activity Spreadsheet -- Enzyme Inhibition Constant Data from BindingDB
Found 2 hits for monomerid = 303012
TargetComplement factor D(Homo sapiens (Human))
Achillion Pharmaceuticals
US Patent
LigandPNGBDBM303012((2S,4R)-1-(2-(3- acetyl-5-(pyrimidin-5- ylamino)-1...)
Affinity DataIC50: <1.00E+3nM. Assay description: Human Factor D (purified from human serum, Complement Technology, Inc.) at 80 nM final concentration is incubated with test compound at various conce...
Ligand InfoPC cidPC sid
In DepthDetails US Patent
TargetComplement factor D(Homo sapiens (Human))
Achillion Pharmaceuticals
US Patent
LigandPNGBDBM303012((2S,4R)-1-(2-(3- acetyl-5-(pyrimidin-5- ylamino)-1...)
Affinity DataIC50: <1.00E+3nM. Assay description: Human factor D (purified from human serum, Complement Technology, Inc.) at 80 nM final concentration is incubated with test compound at various conce...
Ligand InfoPC cidPC sid
In DepthDetails US Patent