BDBM303016 (2S,4R)-1-(2-(3- acetyl-5-(pyrimidin-5- ylamino)-1H-indol-1- yl)acetyl)-4-fluoro-N- (2-(pyridin-2- yl)isoindolin-4- yl)pyrrolidine-2- carboxamide::US9598446, Compound 27
SMILES CC(=O)c1cn(CC(=O)N2C[C@H](F)C[C@H]2C(=O)Cc2cccc3CN(Cc23)c2ccccn2)c2ccc(Nc3cncnc3)cc12
InChI Key InChIKey=HIKAVSNRDVUNRI-GOXGLGGOSA-N
Data  1 IC50
  Tab Delimited (TSV)   2D SDfile   Computed 3D by Vconf -m prep SDfile
Find this compound or compounds like it in BindingDB:
Activity Spreadsheet -- Enzyme Inhibition Constant Data from BindingDB
Found 1 hit for monomerid = 303016
TargetComplement factor D(Homo sapiens (Human))
Achillion Pharmaceuticals
US Patent
LigandPNGBDBM303016((2S,4R)-1-(2-(3- acetyl-5-(pyrimidin-5- ylamino)-1...)
Affinity DataIC50:  5.50E+3nM. Assay description: Human factor D (purified from human serum, Complement Technology, Inc.) at 80 nM final concentration is incubated with test compound at various conce...
Ligand InfoPC cidPC sid
In DepthDetails US Patent