BDBM303097 US10137110, Example 2-14
SMILES COc1cc(ccn1)-c1ccc2n([C@@H]3C[C@H](C)CC(C)(C)C3)c(Nc3ccc(OC(F)(F)F)cc3)nc2c1
InChI Key InChIKey=AKHSZAXUATVIPD-PGRDOPGGSA-N
Data  1 IC50
  Tab Delimited (TSV)   2D SDfile   Computed 3D by Vconf -m prep SDfile
Find this compound or compounds like it in BindingDB:
Activity Spreadsheet -- Enzyme Inhibition Constant Data from BindingDB
Found 1 hit for monomerid = 303097
TargetIsocitrate dehydrogenase [NADP] cytoplasmic [R132H](Homo sapiens (Human))
Bayer Pharma Aktiengesellschaft
US Patent
LigandPNGBDBM303097(US10137110, Example 2-14)
Affinity DataIC50:  1.30E+3nM. Assay description: mIDH1 catalyzes the NADPH-dependent reduction of alpha-ketoglutarate (α-KG) to (2R)-2-hydroxyglutarate (2-HG). NADPH consumption was measured by...
Ligand InfoPC cidPC sid
In DepthDetails US Patent