BDBM303138 US10137202, Compound TAM553
SMILES CCCO[C@H](C[C@H](C(C)C)N(CCC)C(=O)[C@@H](NC(=O)[C@H]1CCCCN1C)[C@@H](C)CC)c1nc(cs1)C(=O)N[C@H](C[C@H](C)C(=O)NNC(=O)OCCOCCNC(=O)OCc1ccc(NC(=O)[C@H](CCCNC(N)=O)NC(=O)[C@@H](NC(=O)CCCCCN2C(=O)C=CC2=O)C(C)C)cc1)Cc1ccccc1
InChI Key InChIKey=GILRDZPBWMMDNB-NOFZBGKUSA-N
Data  2 IC50
  Tab Delimited (TSV)   2D SDfile   Computed 3D by Vconf -m prep SDfile
Find this compound or compounds like it in BindingDB:
Activity Spreadsheet -- Enzyme Inhibition Constant Data from BindingDB
Found 2 hits for monomerid = 303138
TargetProlyl endopeptidase FAP(Homo sapiens (Human))
Oncomatryx Biopharma
US Patent
LigandPNGBDBM303138(US10137202, Compound TAM553)
Affinity DataIC50:  98nM. Assay description: cell proliferation arrest on HT1080 cells (CPA; crystal violet).
Ligand InfoKEGGPC cidPC sid
In DepthDetails US Patent
TargetProlyl endopeptidase FAP(Homo sapiens (Human))
Oncomatryx Biopharma
US Patent
LigandPNGBDBM303138(US10137202, Compound TAM553)
Affinity DataIC50:  6.00E+3nM. Assay description: TPI; Tubulin Polymerization assay kit; Cytoskeleton, Cat. #BK011P.
Ligand InfoKEGGPC cidPC sid
In DepthDetails US Patent