BDBM30325 Pyrrolo-pyrimidone, 18
SMILES CCN(CC)Cc1ccc(C=Cc2cc(ccn2)-c2cc3c(nc[nH]c3=O)[nH]2)cc1
InChI Key InChIKey=KQJAABRPYRXXCA-UHFFFAOYSA-N
Data  1 IC50
  Tab Delimited (TSV)   2D SDfile   Computed 3D by Vconf -m prep SDfile
Find this compound or compounds like it in BindingDB:
Activity Spreadsheet -- Enzyme Inhibition Constant Data from BindingDB
Found 1 hit for monomerid = 30325
TargetMAP kinase-activated protein kinase 2(Homo sapiens (Human))
Novartis
LigandPNGBDBM30325(Pyrrolo-pyrimidone, 18)
Affinity DataIC50:  150nMpH: 7.5 T: 2°C. Assay description: For MK2 inhibition, reactions contained compound or vehicle control, hsp27 peptide substrate and activated MK2 mix containing ATP. After incubation, ...
In DepthDetails ArticlePubMed