BDBM303358 US10138222, Example 73
SMILES Cc1ccc(cc1-c1cnn(c1)-c1cncc(NC2CCN(CC2)C(=O)OC(C)(C)C)c1)C(=O)NC1CC1
InChI Key InChIKey=FYPHQPVKSFOEAT-UHFFFAOYSA-N
Data  1 IC50
  Tab Delimited (TSV)   2D SDfile   Computed 3D by Vconf -m prep SDfile
Find this compound or compounds like it in BindingDB:
Activity Spreadsheet -- Enzyme Inhibition Constant Data from BindingDB
Found 1 hit for monomerid = 303358
TargetReceptor-interacting serine/threonine-protein kinase 2(Homo sapiens (Human))
Boehringer Ingelheim International
US Patent
LigandPNGBDBM303358(US10138222, Example 73)
Affinity DataIC50:  15nM. Assay description: In a 384-well plate, test compound diluted in assay buffer (1% DMSO final) is mixed with 8His-RIPK2 FL enzyme (final concentration of 8 nM). After 15...
Ligand InfoPC cidPC sid
In DepthDetails US Patent