BDBM303411 US10138222, Example 140
SMILES CC(N1CCCC1=O)c1cncc(c1)-n1cc(cn1)-c1cc(ccc1C)C(=O)NC1CC1
InChI Key InChIKey=JMURWDQQEUGGMZ-UHFFFAOYSA-N
Data  1 IC50
  Tab Delimited (TSV)   2D SDfile   Computed 3D by Vconf -m prep SDfile
Find this compound or compounds like it in BindingDB:
Activity Spreadsheet -- Enzyme Inhibition Constant Data from BindingDB
Found 1 hit for monomerid = 303411
TargetReceptor-interacting serine/threonine-protein kinase 2(Homo sapiens (Human))
Boehringer Ingelheim International
US Patent
LigandPNGBDBM303411(US10138222, Example 140)
Affinity DataIC50:  38nM. Assay description: In a 384-well plate, test compound diluted in assay buffer (1% DMSO final) is mixed with 8His-RIPK2 FL enzyme (final concentration of 8 nM). After 15...
Ligand InfoPC cidPC sid
In DepthDetails US Patent