BDBM303498 US10138228, Example 3
SMILES CN(C)S(=O)(=O)NC(=O)c1ccc(CN(C)c2ccc(OCc3c(onc3-c3c(Cl)cccc3Cl)C3CC3)nc2C(F)(F)F)cc1
InChI Key InChIKey=DSXHZFHBVQDDAE-UHFFFAOYSA-N
Data  1 EC50
  Tab Delimited (TSV)   2D SDfile   Computed 3D by Vconf -m prep SDfile
Find this compound or compounds like it in BindingDB:
Activity Spreadsheet -- Enzyme Inhibition Constant Data from BindingDB
Found 1 hit for monomerid = 303498
TargetBile acid receptor(Homo sapiens (Human))
Enanta Pharmaceuticals
US Patent
LigandPNGBDBM303498(US10138228, Example 3)
Affinity DataEC50: <100nM. Assay description: Determination of a ligand mediated Gal4 promoter driven transactivation to quantify ligand binding mediated activation of FXR. FXR Reporter Assay kit...
Ligand InfoPC cidPC sid
In DepthDetails US Patent