BDBM303509 US10138229, Example 23::US10875852, Example 23
SMILES NC(=O)c1cn(nc1-c1ccc(Oc2ccccc2)c(F)c1)[C@@H]1CCCN(C1)C(=O)C=C
InChI Key InChIKey=MOTLAQLHNKYYKF-QGZVFWFLSA-N
Data  2 IC50
  Tab Delimited (TSV)   2D SDfile   Computed 3D by Vconf -m prep SDfile
Find this compound or compounds like it in BindingDB:
Activity Spreadsheet -- Enzyme Inhibition Constant Data from BindingDB
Found 2 hits for monomerid = 303509
TargetTyrosine-protein kinase BTK(Homo sapiens (Human))
Boehringer Ingelheim International
US Patent
LigandPNGBDBM303509(US10138229, Example 23 | US10875852, Example 23)
Affinity DataIC50:  10nM. Assay description: An HTRF assay (Cisbio KinEASE-TK cat #62TK0PEC) was performed to quantitate the ability of test compounds to inhibit BTK mediated phosphorylation of ...
Ligand InfoPC cidPC sid
In DepthDetails US Patent
TargetTyrosine-protein kinase BTK(Homo sapiens (Human))
Boehringer Ingelheim International
US Patent
LigandPNGBDBM303509(US10138229, Example 23 | US10875852, Example 23)
Affinity DataIC50:  10nM. Assay description: TBDAn HTRF assay (Cisbio KinEASE-TK cat #62TKOPEC) was performed to quantitate the ability of test compounds to inhibit BTK mediated phosphorylation ...
Ligand InfoPC cidPC sid
In DepthDetails US Patent