BDBM303554 US10138229, Example 65::US10875852, Example 65
SMILES CS(=O)(=O)c1cccc(Oc2ccc(cc2)-c2nn(cc2C(N)=O)[C@@H]2CCCN(C2)C(=O)C=C)c1
InChI Key InChIKey=SQMHBOFKGXCKDY-GOSISDBHSA-N
Data  2 IC50
  Tab Delimited (TSV)   2D SDfile   Computed 3D by Vconf -m prep SDfile
Find this compound or compounds like it in BindingDB:
Activity Spreadsheet -- Enzyme Inhibition Constant Data from BindingDB
Found 2 hits for monomerid = 303554
TargetTyrosine-protein kinase BTK(Homo sapiens (Human))
Boehringer Ingelheim International
US Patent
LigandPNGBDBM303554(US10138229, Example 65 | US10875852, Example 65)
Affinity DataIC50:  330nM. Assay description: An HTRF assay (Cisbio KinEASE-TK cat #62TK0PEC) was performed to quantitate the ability of test compounds to inhibit BTK mediated phosphorylation of ...
Ligand InfoPC cidPC sid
In DepthDetails US Patent
TargetTyrosine-protein kinase BTK(Homo sapiens (Human))
Boehringer Ingelheim International
US Patent
LigandPNGBDBM303554(US10138229, Example 65 | US10875852, Example 65)
Affinity DataIC50:  330nM. Assay description: TBDAn HTRF assay (Cisbio KinEASE-TK cat #62TKOPEC) was performed to quantitate the ability of test compounds to inhibit BTK mediated phosphorylation ...
Ligand InfoPC cidPC sid
In DepthDetails US Patent