BDBM303615 US10138229, Example 127::US10875852, Example 127
SMILES CCCOc1ccc(cc1)-c1nn([C@H]2C[C@@]3(C2)CCN(C3)C(=O)C#CC)c(N)c1C(N)=O
InChI Key InChIKey=MUKORWWHAYUMRG-SMQSCJQKSA-N
Data  2 IC50
  Tab Delimited (TSV)   2D SDfile   Computed 3D by Vconf -m prep SDfile
Find this compound or compounds like it in BindingDB:
Activity Spreadsheet -- Enzyme Inhibition Constant Data from BindingDB
Found 2 hits for monomerid = 303615
TargetTyrosine-protein kinase BTK(Homo sapiens (Human))
Boehringer Ingelheim International
US Patent
LigandPNGBDBM303615(US10138229, Example 127 | US10875852, Example 127)
Affinity DataIC50:  15nM. Assay description: An HTRF assay (Cisbio KinEASE-TK cat #62TK0PEC) was performed to quantitate the ability of test compounds to inhibit BTK mediated phosphorylation of ...
Ligand InfoPC cidPC sid
In DepthDetails US Patent
TargetTyrosine-protein kinase BTK(Homo sapiens (Human))
Boehringer Ingelheim International
US Patent
LigandPNGBDBM303615(US10138229, Example 127 | US10875852, Example 127)
Affinity DataIC50:  15nM. Assay description: TBDAn HTRF assay (Cisbio KinEASE-TK cat #62TKOPEC) was performed to quantitate the ability of test compounds to inhibit BTK mediated phosphorylation ...
Ligand InfoPC cidPC sid
In DepthDetails US Patent