BDBM303689 BDBM303695::N-[5-[2-(4- chlorophenyl)ethyl]- 1,3,4-thiadiazol-2-yl]-1- [4-[[(2S,6R)-2,6- dimethylmorpholin-4- yl]methyl]phenyl]-5-oxo- pyrrolidine-3- carboxamide::US10138230, Example F119
SMILES [H][C@]1(C)CN(Cc2ccc(cc2)N2CC(CC2=O)C(=O)Nc2nnc(CCc3ccc(Cl)cc3)s2)C[C@@]([H])(C)O1
InChI Key InChIKey=QVLFINWHCAYNBQ-QIDMFYOTSA-N
Data  2 IC50
  Tab Delimited (TSV)   2D SDfile   Computed 3D by Vconf -m prep SDfile
Find this compound or compounds like it in BindingDB:
Activity Spreadsheet -- Enzyme Inhibition Constant Data from BindingDB
Found 2 hits for monomerid = 303689
TargetEctonucleotide pyrophosphatase/phosphodiesterase family member 2(Homo sapiens (Human))
Cancer Research Technology
US Patent
LigandPNGBDBM303689(BDBM303695 | N-[5-[2-(4- chlorophenyl)ethyl]- 1,3,...)
Affinity DataIC50:  8nM. Assay description: Measuring ATX activity using an enzyme coupled Quanta Red assay (Thermo Scientific Pierce Protein Research Products, Product #15159) was determined a...
Ligand InfoPC cidPC sid
In DepthDetails US Patent
TargetEctonucleotide pyrophosphatase/phosphodiesterase family member 2(Homo sapiens (Human))
Cancer Research Technology
US Patent
LigandPNGBDBM303689(BDBM303695 | N-[5-[2-(4- chlorophenyl)ethyl]- 1,3,...)
Affinity DataIC50:  4nM. Assay description: Measuring ATX activity using an enzyme coupled Quanta Red assay (Thermo Scientific Pierce Protein Research Products, Product #15159) was determined a...
Ligand InfoPC cidPC sid
In DepthDetails US Patent