BDBM303723 4-[[[5-[2-(4- chlorophenyl)ethyl]- 1,3,4-thiadiazol-2- yl]amino]methyl]-1-[4- (morpholinomethyl) phenyl]pyrrolidin-2-one::US10138230, Example F153
SMILES Clc1ccc(CCc2nnc(NCC3CN(C(=O)C3)c3ccc(CN4CCOCC4)cc3)s2)cc1
InChI Key InChIKey=YVBHUXITHOVNJB-UHFFFAOYSA-N
Data  1 IC50
  Tab Delimited (TSV)   2D SDfile   Computed 3D by Vconf -m prep SDfile
Find this compound or compounds like it in BindingDB:
Activity Spreadsheet -- Enzyme Inhibition Constant Data from BindingDB
Found 1 hit for monomerid = 303723
TargetEctonucleotide pyrophosphatase/phosphodiesterase family member 2(Homo sapiens (Human))
Cancer Research Technology
US Patent
LigandPNGBDBM303723(4-[[[5-[2-(4- chlorophenyl)ethyl]- 1,3,4-thiadiazo...)
Affinity DataIC50:  2nM. Assay description: Measuring ATX activity using an enzyme coupled Quanta Red assay (Thermo Scientific Pierce Protein Research Products, Product #15159) was determined a...
Ligand InfoPC cidPC sid
In DepthDetails US Patent