BDBM303737 5-[2-(4- chlorophenyl)ethyl]-N- [(3S)-1-[4- (morpholinomethyl) phenyl]pyrrolidin- 3-yl]-1,3,4- thiadiazole-2- carboxamide::US10138230, Example F167
SMILES [H][C@@]1(CCN(C1)c1ccc(CN2CCOCC2)cc1)NC(=O)c1nnc(CCc2ccc(Cl)cc2)s1
InChI Key InChIKey=UCDAXBUFGNGLJH-QFIPXVFZSA-N
Data  1 IC50
  Tab Delimited (TSV)   2D SDfile   Computed 3D by Vconf -m prep SDfile
Find this compound or compounds like it in BindingDB:
Activity Spreadsheet -- Enzyme Inhibition Constant Data from BindingDB
Found 1 hit for monomerid = 303737
TargetEctonucleotide pyrophosphatase/phosphodiesterase family member 2(Homo sapiens (Human))
Cancer Research Technology
US Patent
LigandPNGBDBM303737(5-[2-(4- chlorophenyl)ethyl]-N- [(3S)-1-[4- (morph...)
Affinity DataIC50:  16nM. Assay description: Measuring ATX activity using an enzyme coupled Quanta Red assay (Thermo Scientific Pierce Protein Research Products, Product #15159) was determined a...
Ligand InfoPC cidPC sid
In DepthDetails US Patent