BDBM303746 1-[4- (morpholinomethyl) phenyl]-5- oxo-N-[5-(2- phenylethyl)-1,3,4- thiadiazol-2- yl]pyrrolidine-3- carboxamide::US10138230, Example F176
SMILES O=C(Nc1nnc(CCc2ccccc2)s1)C1CN(C(=O)C1)c1ccc(CN2CCOCC2)cc1
InChI Key InChIKey=XXSFUBDFCPFNDL-UHFFFAOYSA-N
Data  1 IC50
  Tab Delimited (TSV)   2D SDfile   Computed 3D by Vconf -m prep SDfile
Find this compound or compounds like it in BindingDB:
Activity Spreadsheet -- Enzyme Inhibition Constant Data from BindingDB
Found 1 hit for monomerid = 303746
TargetEctonucleotide pyrophosphatase/phosphodiesterase family member 2(Homo sapiens (Human))
Cancer Research Technology
US Patent
LigandPNGBDBM303746(1-[4- (morpholinomethyl) phenyl]-5- oxo-N-[5-(2- p...)
Affinity DataIC50:  11nM. Assay description: Measuring ATX activity using an enzyme coupled Quanta Red assay (Thermo Scientific Pierce Protein Research Products, Product #15159) was determined a...
Ligand InfoPC cidPC sid
In DepthDetails US Patent