BDBM303799 2-(11′-Chloro-2′,5′-dioxo-2′,5′,6′,8′-tetrahydro-3′H-spiro[cyclopropane-1,7′-pyrido[3,4-e][3]benzazocine]-3′-yl)-N-(imidazo[1,2-a]pyridin-6-yl)-4-methoxybutanamide (Stereoisomer Mixture)::US10138236, Example 17
SMILES COCCC(C(=O)Nc1ccc2nccn2c1)n1cc2c(cc1=O)-c1cc(Cl)ccc1CC1(CC1)NC2=O
InChI Key InChIKey=LJUIKBIWSCZQIA-UHFFFAOYSA-N
Data  2 IC50
  Tab Delimited (TSV)   2D SDfile   Computed 3D by Vconf -m prep SDfile
Find this compound or compounds like it in BindingDB:
Activity Spreadsheet -- Enzyme Inhibition Constant Data from BindingDB
Found 2 hits for monomerid = 303799
TargetPlasma kallikrein(Homo sapiens (Human))
Bayer Pharma Aktiengesellschaft
US Patent
LigandPNGBDBM303799(2-(11′-Chloro-2′,5′-dioxo-2̸...)
Affinity DataIC50:  1.20E+3nM. Assay description: o determine the plasma kallikrein inhibition of the substances according to the invention, a biochemical test system is used which utilizes the react...
Ligand InfoPC cidPC sid
In DepthDetails US Patent
TargetCoagulation factor XI(Homo sapiens (Human))
Bayer Pharma Aktiengesellschaft
US Patent
LigandPNGBDBM303799(2-(11′-Chloro-2′,5′-dioxo-2̸...)
Affinity DataIC50:  44nM. Assay description: The factor XIa inhibition of the substances according to the invention is determined using a biochemical test system which utilizes the reaction of a...
Ligand InfoPC cidPC sid
In DepthDetails US Patent