BDBM303824 US10138241, Example 8::US11130754, Example 8
SMILES Nc1cccn2c(cnc12)-n1cc(cn1)-c1cc(C(=O)NC2CC2)c(F)cc1Cl
InChI Key InChIKey=GDMYDDDXCLNKLU-UHFFFAOYSA-N
Data  2 IC50
  Tab Delimited (TSV)   2D SDfile   Computed 3D by Vconf -m prep SDfile
Find this compound or compounds like it in BindingDB:
Activity Spreadsheet -- Enzyme Inhibition Constant Data from BindingDB
Found 2 hits for monomerid = 303824
TargetReceptor-interacting serine/threonine-protein kinase 2(Homo sapiens (Human))
Boehringer Ingelheim International
US Patent
LigandPNGBDBM303824(US10138241, Example 8 | US11130754, Example 8)
Affinity DataIC50:  14nM. Assay description: Method: In a 384-well plate, test compound diluted in assay buffer (1% DMSO final) is mixed with 8His-RIPK2 FL enzyme (final concentration of 8 nM). ...
Ligand InfoPC cidPC sid
In DepthDetails US Patent
TargetReceptor-interacting serine/threonine-protein kinase 2(Homo sapiens (Human))
Boehringer Ingelheim International
US Patent
LigandPNGBDBM303824(US10138241, Example 8 | US11130754, Example 8)
Affinity DataIC50:  14nM. Assay description: In a 384-well plate, test compound diluted in assay buffer (1% DMSO final) is mixed with 8His-RIPK2 FL enzyme (final concentration of 8 nM). After 15...
Ligand InfoPC cidPC sid
In DepthDetails US Patent