BDBM303837 US10138241, Example 22
SMILES Cc1ccc(cc1-c1cn(cn1)-c1cnc2ccc(cn12)S(=O)(=O)C(C)(C)C)C(=O)NC1CC1
InChI Key InChIKey=OUASJXRUPLRIHZ-UHFFFAOYSA-N
Data  1 IC50
  Tab Delimited (TSV)   2D SDfile   Computed 3D by Vconf -m prep SDfile
Find this compound or compounds like it in BindingDB:
Activity Spreadsheet -- Enzyme Inhibition Constant Data from BindingDB
Found 1 hit for monomerid = 303837
TargetReceptor-interacting serine/threonine-protein kinase 2(Homo sapiens (Human))
Boehringer Ingelheim International
US Patent
LigandPNGBDBM303837(US10138241, Example 22)
Affinity DataIC50:  66nM. Assay description: In a 384-well plate, test compound diluted in assay buffer (1% DMSO final) is mixed with 8His-RIPK2 FL enzyme (final concentration of 8 nM). After 15...
Ligand InfoPC cidPC sid
In DepthDetails US Patent