BDBM303849 US10138241, Example 35::US11130754, Example 35
SMILES COc1cc2ncc(-n3cc(cn3)-c3cc(ccc3C)C(=O)NC3CC3)n2cc1S(=O)(=O)C(C)(C)C
InChI Key InChIKey=QYTPVPZFNIIUQN-UHFFFAOYSA-N
Data  2 IC50
  Tab Delimited (TSV)   2D SDfile   Computed 3D by Vconf -m prep SDfile
Find this compound or compounds like it in BindingDB:
Activity Spreadsheet -- Enzyme Inhibition Constant Data from BindingDB
Found 2 hits for monomerid = 303849
TargetReceptor-interacting serine/threonine-protein kinase 2(Homo sapiens (Human))
Boehringer Ingelheim International
US Patent
LigandPNGBDBM303849(US10138241, Example 35 | US11130754, Example 35)
Affinity DataIC50:  1.20nM. Assay description: Method: In a 384-well plate, test compound diluted in assay buffer (1% DMSO final) is mixed with 8His-RIPK2 FL enzyme (final concentration of 8 nM). ...
Ligand InfoPC cidPC sid
In DepthDetails US Patent
TargetReceptor-interacting serine/threonine-protein kinase 2(Homo sapiens (Human))
Boehringer Ingelheim International
US Patent
LigandPNGBDBM303849(US10138241, Example 35 | US11130754, Example 35)
Affinity DataIC50:  1.20nM. Assay description: In a 384-well plate, test compound diluted in assay buffer (1% DMSO final) is mixed with 8His-RIPK2 FL enzyme (final concentration of 8 nM). After 15...
Ligand InfoPC cidPC sid
In DepthDetails US Patent