BDBM303873 US10138241, Example 61::US11130754, Example 61
SMILES Cc1ccc(cc1-c1cnn(c1)-c1cnc2cc(ccn12)C(=O)NCCO)C(=O)NC1CC1
InChI Key InChIKey=OWJULMWKOSUUJQ-UHFFFAOYSA-N
Data  2 IC50
  Tab Delimited (TSV)   2D SDfile   Computed 3D by Vconf -m prep SDfile
Find this compound or compounds like it in BindingDB:
Activity Spreadsheet -- Enzyme Inhibition Constant Data from BindingDB
Found 2 hits for monomerid = 303873
TargetReceptor-interacting serine/threonine-protein kinase 2(Homo sapiens (Human))
Boehringer Ingelheim International
US Patent
LigandPNGBDBM303873(US10138241, Example 61 | US11130754, Example 61)
Affinity DataIC50:  4.80nM. Assay description: Method: In a 384-well plate, test compound diluted in assay buffer (1% DMSO final) is mixed with 8His-RIPK2 FL enzyme (final concentration of 8 nM). ...
Ligand InfoKEGGPC cidPC sid
In DepthDetails US Patent
TargetReceptor-interacting serine/threonine-protein kinase 2(Homo sapiens (Human))
Boehringer Ingelheim International
US Patent
LigandPNGBDBM303873(US10138241, Example 61 | US11130754, Example 61)
Affinity DataIC50:  4.80nM. Assay description: In a 384-well plate, test compound diluted in assay buffer (1% DMSO final) is mixed with 8His-RIPK2 FL enzyme (final concentration of 8 nM). After 15...
Ligand InfoKEGGPC cidPC sid
In DepthDetails US Patent