BDBM303890 N-Cyclopropyl-3-{1-[7-hydroxy-6-(2-methyl-propane-2-sulfonyl)-imidazo[1,2-a]pyridin-2-yl]-1H-pyrazol-4-yl}-4-methyl-benzamide::US10138241, Example 78::US11130754, Example 78
SMILES Cc1ccc(cc1-c1cnn(c1)-c1cn2cc(c(O)cc2n1)S(=O)(=O)C(C)(C)C)C(=O)NC1CC1
InChI Key InChIKey=DPXSTHXTFDQAMH-UHFFFAOYSA-N
Data  2 IC50
  Tab Delimited (TSV)   2D SDfile   Computed 3D by Vconf -m prep SDfile
Find this compound or compounds like it in BindingDB:
Activity Spreadsheet -- Enzyme Inhibition Constant Data from BindingDB
Found 2 hits for monomerid = 303890
TargetReceptor-interacting serine/threonine-protein kinase 2(Homo sapiens (Human))
Boehringer Ingelheim International
US Patent
LigandPNGBDBM303890(N-Cyclopropyl-3-{1-[7-hydroxy-6-(2-methyl-propane-...)
Affinity DataIC50:  500nM. Assay description: Method: In a 384-well plate, test compound diluted in assay buffer (1% DMSO final) is mixed with 8His-RIPK2 FL enzyme (final concentration of 8 nM). ...
Ligand InfoPC cidPC sid
In DepthDetails US Patent
TargetReceptor-interacting serine/threonine-protein kinase 2(Homo sapiens (Human))
Boehringer Ingelheim International
US Patent
LigandPNGBDBM303890(N-Cyclopropyl-3-{1-[7-hydroxy-6-(2-methyl-propane-...)
Affinity DataIC50:  500nM. Assay description: In a 384-well plate, test compound diluted in assay buffer (1% DMSO final) is mixed with 8His-RIPK2 FL enzyme (final concentration of 8 nM). After 15...
Ligand InfoPC cidPC sid
In DepthDetails US Patent