BDBM303900 US10138241, Example 87::US11130754, Example 87
SMILES Cc1ccc(cc1-c1cnn(c1)-c1cnc2CCCCn12)C(=O)NC1CC1
InChI Key InChIKey=URVRYASCDAOVEB-UHFFFAOYSA-N
Data  2 IC50
  Tab Delimited (TSV)   2D SDfile   Computed 3D by Vconf -m prep SDfile
Find this compound or compounds like it in BindingDB:
Activity Spreadsheet -- Enzyme Inhibition Constant Data from BindingDB
Found 2 hits for monomerid = 303900
TargetReceptor-interacting serine/threonine-protein kinase 2(Homo sapiens (Human))
Boehringer Ingelheim International
US Patent
LigandPNGBDBM303900(US10138241, Example 87 | US11130754, Example 87)
Affinity DataIC50:  190nM. Assay description: Method: In a 384-well plate, test compound diluted in assay buffer (1% DMSO final) is mixed with 8His-RIPK2 FL enzyme (final concentration of 8 nM). ...
Ligand InfoPC cidPC sid
In DepthDetails US Patent
TargetReceptor-interacting serine/threonine-protein kinase 2(Homo sapiens (Human))
Boehringer Ingelheim International
US Patent
LigandPNGBDBM303900(US10138241, Example 87 | US11130754, Example 87)
Affinity DataIC50:  190nM. Assay description: In a 384-well plate, test compound diluted in assay buffer (1% DMSO final) is mixed with 8His-RIPK2 FL enzyme (final concentration of 8 nM). After 15...
Ligand InfoPC cidPC sid
In DepthDetails US Patent