BDBM303909 N-Cyclopropyl-5-{1-[7-ethoxy-6-(4-fluoro-1-methyl-piperidin-4-yl)-imidazo[1,2-a]pyridin-3-yl]-1H-pyrazol-4-yl}-2-fluoro-4-methyl-benzamide::US10138241, Example 96::US11130754, Example 96
SMILES CCOc1cc2ncc(-n3cc(cn3)-c3cc(C(=O)NC4CC4)c(F)cc3C)n2cc1C1(F)CCN(C)CC1
InChI Key InChIKey=ZRUUJLVXQJKMEW-UHFFFAOYSA-N
Data  2 IC50
  Tab Delimited (TSV)   2D SDfile   Computed 3D by Vconf -m prep SDfile
Find this compound or compounds like it in BindingDB:
Activity Spreadsheet -- Enzyme Inhibition Constant Data from BindingDB
Found 2 hits for monomerid = 303909
TargetReceptor-interacting serine/threonine-protein kinase 2(Homo sapiens (Human))
Boehringer Ingelheim International
US Patent
LigandPNGBDBM303909(N-Cyclopropyl-5-{1-[7-ethoxy-6-(4-fluoro-1-methyl-...)
Affinity DataIC50:  1.10nM. Assay description: Method: In a 384-well plate, test compound diluted in assay buffer (1% DMSO final) is mixed with 8His-RIPK2 FL enzyme (final concentration of 8 nM). ...
Ligand InfoPC cidPC sid
In DepthDetails US Patent
TargetReceptor-interacting serine/threonine-protein kinase 2(Homo sapiens (Human))
Boehringer Ingelheim International
US Patent
LigandPNGBDBM303909(N-Cyclopropyl-5-{1-[7-ethoxy-6-(4-fluoro-1-methyl-...)
Affinity DataIC50:  1.10nM. Assay description: In a 384-well plate, test compound diluted in assay buffer (1% DMSO final) is mixed with 8His-RIPK2 FL enzyme (final concentration of 8 nM). After 15...
Ligand InfoPC cidPC sid
In DepthDetails US Patent