BDBM303929 US10138242, Compound 15
SMILES COc1ccc(CN2CCc3c(C2)c(nn3C2CN(C2)C(=O)C(C)(C)C)C(=O)NCc2cccc3ccccc23)c2ccccc12
InChI Key InChIKey=ULRAWGXXKHFWCU-UHFFFAOYSA-N
Data  1 IC50  1 EC50
  Tab Delimited (TSV)   2D SDfile   Computed 3D by Vconf -m prep SDfile
Find this compound or compounds like it in BindingDB:
Activity Spreadsheet -- Enzyme Inhibition Constant Data from BindingDB
Found 2 hits for monomerid = 303929
TargetPEX5-related protein/Peroxisomal membrane protein PEX14(Homo sapiens (Human))
TBA
US Patent
LigandPNGBDBM303929(US10138242, Compound 15)
Affinity DataIC50:  1.09E+3nM. Assay description: Antitrypanosomal activity was tested on T. brucei brucei bloodstream from parasites (strainżLister 427, VATMITat 1.2). Stock solutions of compounds (...
Ligand InfoPC cidPC sid
In DepthDetails US Patent
TargetPEX5-related protein/Peroxisomal membrane protein PEX14(Homo sapiens (Human))
TBA
US Patent
LigandPNGBDBM303929(US10138242, Compound 15)
Affinity DataEC50:  7.92E+3nM. Assay description: The assay uses two types of beads: donor beads are coupled with streptavidin, and acceptor beads are coupled with an anti His-tag antibody. Upon exci...
Ligand InfoPC cidPC sid
In DepthDetails US Patent