BDBM303952 US10138242, Compound 38
SMILES OCCn1nc(C(=O)NCc2cccc3ccccc23)c2CN(Cc3ccc(cc3)-c3ccccc3)CCc12
InChI Key InChIKey=RFRYRSUMEQEYLZ-UHFFFAOYSA-N
Data  1 IC50  1 EC50
  Tab Delimited (TSV)   2D SDfile   Computed 3D by Vconf -m prep SDfile
Find this compound or compounds like it in BindingDB:
Activity Spreadsheet -- Enzyme Inhibition Constant Data from BindingDB
Found 2 hits for monomerid = 303952
TargetPEX5-related protein/Peroxisomal membrane protein PEX14(Homo sapiens (Human))
TBA
US Patent
LigandPNGBDBM303952(US10138242, Compound 38)
Affinity DataIC50:  880nM. Assay description: Antitrypanosomal activity was tested on T. brucei brucei bloodstream from parasites (strainżLister 427, VATMITat 1.2). Stock solutions of compounds (...
Ligand InfoPC cidPC sid
In DepthDetails US Patent
TargetPEX5-related protein/Peroxisomal membrane protein PEX14(Homo sapiens (Human))
TBA
US Patent
LigandPNGBDBM303952(US10138242, Compound 38)
Affinity DataEC50:  1.04E+4nM. Assay description: The assay uses two types of beads: donor beads are coupled with streptavidin, and acceptor beads are coupled with an anti His-tag antibody. Upon exci...
Ligand InfoPC cidPC sid
In DepthDetails US Patent