BDBM304142 2-(1-((4- carboxyphenyl)amino)-3- ((1r,4r)-4-hydroxy-4- methylcyclohexyl)-1- oxopropan-2-yl)-5-(3-chloro- 6-(difluoromethyl)-2- fluorophenyl)pyridine 1-oxide::BDBM304143::US10143681, Example 46
SMILES C[C@]1(O)CC[C@H](CC(C(=O)Nc2ccc(cc2)C(O)=O)c2ccc(c[n+]2[O-])-c2c(F)c(Cl)ccc2C(F)F)CC1
InChI Key InChIKey=ZWADCLCEAFKXOC-LWAJIUGYSA-N
Data  3 IC50
  Tab Delimited (TSV)   2D SDfile   Computed 3D by Vconf -m prep SDfile
Find this compound or compounds like it in BindingDB:
Activity Spreadsheet -- Enzyme Inhibition Constant Data from BindingDB
Found 3 hits for monomerid = 304142
TargetCoagulation factor XI(Homo sapiens (Human))
Merck Sharp & Dohme
US Patent
LigandPNGBDBM304142(2-(1-((4- carboxyphenyl)amino)-3- ((1r,4r)-4-hydro...)
Affinity DataIC50:  128nM. Assay description: The effectiveness of a compound of the present invention as an inhibitor of Coagulation Factor XIa can be determined using a relevant purified serine...
Ligand InfoPC cidPC sid
In DepthDetails US Patent
TargetPlasma kallikrein(Homo sapiens (Human))
Merck Sharp & Dohme
US Patent
LigandPNGBDBM304142(2-(1-((4- carboxyphenyl)amino)-3- ((1r,4r)-4-hydro...)
Affinity DataIC50:  20nM. Assay description: The effectiveness of a compound of the present invention as an inhibitor of Kallikrein can be determined using a relevant purified serine protease, a...
Ligand InfoPC cidPC sid
In DepthDetails US Patent
TargetCoagulation factor XI(Homo sapiens (Human))
Merck Sharp & Dohme
US Patent
LigandPNGBDBM304142(2-(1-((4- carboxyphenyl)amino)-3- ((1r,4r)-4-hydro...)
Affinity DataIC50:  0.560nM. Assay description: The effectiveness of a compound of the present invention as an inhibitor of Coagulation Factor XIa can be determined using a relevant purified serine...
Ligand InfoPC cidPC sid
In DepthDetails US Patent