BDBM304163 USRE47141, Example 145
SMILES Cc1cccc(n1)-c1[nH]c(Cc2cccc(c2)C#N)nc1-c1ccc2ncnn2c1
InChI Key InChIKey=DEMRLJXRWRAHNY-UHFFFAOYSA-N
Data  1 IC50
  Tab Delimited (TSV)   2D SDfile   Computed 3D by Vconf -m prep SDfile
Find this compound or compounds like it in BindingDB:
Activity Spreadsheet -- Enzyme Inhibition Constant Data from BindingDB
Found 1 hit for monomerid = 304163
TargetTGF-beta receptor type-1(Homo sapiens (Human))
Ewha University—Industry Collaboration Foundation
US Patent
LigandPNGBDBM304163(USRE47141, Example 145)
Affinity DataIC50:  12.4nM. Assay description: ALK5 protein was expressed in Sf9 insect cells as human recombinant GST-fusion protein using the baculovirus expression system. Expressed protein was...
Ligand InfoPC cidPC sid
In DepthDetails US Patent