BDBM304176 (R)-2-(1-((4-carboxyphenyl)amino)-3-cyclopropyl-1-oxopropan-2-yl)-5-(3-chloro-6-(difluoromethoxy)-2-fluorophenyl)-4-methylpyridine 1-oxide::US10143681, Example 67
SMILES Cc1cc(C(CC2CC2)C(=O)Nc2ccc(cc2)C(O)=O)[n+]([O-])cc1-c1c(F)c(Cl)ccc1OC(F)F
InChI Key InChIKey=SBOPWGCTRJOEET-UHFFFAOYSA-N
Data  1 IC50
  Tab Delimited (TSV)   2D SDfile   Computed 3D by Vconf -m prep SDfile
Find this compound or compounds like it in BindingDB:
Activity Spreadsheet -- Enzyme Inhibition Constant Data from BindingDB
Found 1 hit for monomerid = 304176
TargetCoagulation factor XI(Homo sapiens (Human))
Merck Sharp & Dohme
US Patent
LigandPNGBDBM304176((R)-2-(1-((4-carboxyphenyl)amino)-3-cyclopropyl-1-...)
Affinity DataIC50:  11nM. Assay description: The effectiveness of a compound of the present invention as an inhibitor of Coagulation Factor XIa can be determined using a relevant purified serine...
Ligand InfoPC cidPC sid
In DepthDetails US Patent