BDBM304198 2-(1-((4- carboxyphenyl)amino)-3-(2- (difluoromethyl)cyclopropyl)- 1-oxopropan-2-yl)-5-(3- chloro-6-(difluoromethyl)- 2-fluorophenyl)pyridine-1- oxide::BDBM304199::US10143681, Example 89
SMILES OC(=O)c1ccc(NC(=O)C(CC2CC2C(F)F)c2ccc(c[n+]2[O-])-c2c(F)c(Cl)ccc2C(F)F)cc1
InChI Key InChIKey=CIBAUUPUKBYRIO-UHFFFAOYSA-N
Data  4 IC50
  Tab Delimited (TSV)   2D SDfile   Computed 3D by Vconf -m prep SDfile
Find this compound or compounds like it in BindingDB:
Activity Spreadsheet -- Enzyme Inhibition Constant Data from BindingDB
Found 4 hits for monomerid = 304198
TargetCoagulation factor XI(Homo sapiens (Human))
Merck Sharp & Dohme
US Patent
LigandPNGBDBM304198(2-(1-((4- carboxyphenyl)amino)-3-(2- (difluorometh...)
Affinity DataIC50:  0.600nM. Assay description: The effectiveness of a compound of the present invention as an inhibitor of Coagulation Factor XIa can be determined using a relevant purified serine...
Ligand InfoPC cidPC sid
In DepthDetails US Patent
TargetPlasma kallikrein(Homo sapiens (Human))
Merck Sharp & Dohme
US Patent
LigandPNGBDBM304198(2-(1-((4- carboxyphenyl)amino)-3-(2- (difluorometh...)
Affinity DataIC50:  5.30nM. Assay description: The effectiveness of a compound of the present invention as an inhibitor of Kallikrein can be determined using a relevant purified serine protease, a...
Ligand InfoPC cidPC sid
In DepthDetails US Patent
TargetCoagulation factor XI(Homo sapiens (Human))
Merck Sharp & Dohme
US Patent
LigandPNGBDBM304198(2-(1-((4- carboxyphenyl)amino)-3-(2- (difluorometh...)
Affinity DataIC50:  1.10nM. Assay description: The effectiveness of a compound of the present invention as an inhibitor of Coagulation Factor XIa can be determined using a relevant purified serine...
Ligand InfoPC cidPC sid
In DepthDetails US Patent
TargetPlasma kallikrein(Homo sapiens (Human))
Merck Sharp & Dohme
US Patent
LigandPNGBDBM304198(2-(1-((4- carboxyphenyl)amino)-3-(2- (difluorometh...)
Affinity DataIC50:  7.10nM. Assay description: The effectiveness of a compound of the present invention as an inhibitor of Kallikrein can be determined using a relevant purified serine protease, a...
Ligand InfoPC cidPC sid
In DepthDetails US Patent