BDBM304230 2-(1-((4-carboxy-3- methylphenyl)amino)-3- cyclopropyl-1-oxopropan-2- yl)-5-(3-chloro-6- (difluoromethyl)-2- fluorophenyl)pyridine 1- oxide::BDBM304231::US10143681, Example 121
SMILES Cc1cc(NC(=O)C(CC2CC2)c2ccc(c[n+]2[O-])-c2c(F)c(Cl)ccc2C(F)F)ccc1C(O)=O
InChI Key InChIKey=PGJOTSZZDJNXMF-UHFFFAOYSA-N
Data  3 IC50
  Tab Delimited (TSV)   2D SDfile   Computed 3D by Vconf -m prep SDfile
Find this compound or compounds like it in BindingDB:
Activity Spreadsheet -- Enzyme Inhibition Constant Data from BindingDB
Found 3 hits for monomerid = 304230
TargetCoagulation factor XI(Homo sapiens (Human))
Merck Sharp & Dohme
US Patent
LigandPNGBDBM304230(2-(1-((4-carboxy-3- methylphenyl)amino)-3- cyclopr...)
Affinity DataIC50:  620nM. Assay description: The effectiveness of a compound of the present invention as an inhibitor of Coagulation Factor XIa can be determined using a relevant purified serine...
Ligand InfoPC cidPC sid
In DepthDetails US Patent
TargetPlasma kallikrein(Homo sapiens (Human))
Merck Sharp & Dohme
US Patent
LigandPNGBDBM304230(2-(1-((4-carboxy-3- methylphenyl)amino)-3- cyclopr...)
Affinity DataIC50:  69.8nM. Assay description: The effectiveness of a compound of the present invention as an inhibitor of Kallikrein can be determined using a relevant purified serine protease, a...
Ligand InfoPC cidPC sid
In DepthDetails US Patent
TargetCoagulation factor XI(Homo sapiens (Human))
Merck Sharp & Dohme
US Patent
LigandPNGBDBM304230(2-(1-((4-carboxy-3- methylphenyl)amino)-3- cyclopr...)
Affinity DataIC50:  9.90nM. Assay description: The effectiveness of a compound of the present invention as an inhibitor of Coagulation Factor XIa can be determined using a relevant purified serine...
Ligand InfoPC cidPC sid
In DepthDetails US Patent