BDBM304717 US10144729, Example 1a
SMILES CN(C)S(=O)(=O)NC(=O)c1ccc(cc1)[C@@H]1C[C@H]1c1ccc(OCc2c(onc2-c2c(Cl)cccc2Cl)C2CC2)cc1Cl
InChI Key InChIKey=ZQTKQIYJXNDJQY-GOTSBHOMSA-N
Data  1 EC50
  Tab Delimited (TSV)   2D SDfile   Computed 3D by Vconf -m prep SDfile
Find this compound or compounds like it in BindingDB:
Activity Spreadsheet -- Enzyme Inhibition Constant Data from BindingDB
Found 1 hit for monomerid = 304717
TargetBile acid receptor(Homo sapiens (Human))
Enanta Pharmaceuticals
US Patent
LigandPNGBDBM304717(US10144729, Example 1a)
Affinity DataEC50:  550nM. Assay description: The assay utilizes non-human mammalian cells, CHO (Chinese hamster ovary) cells engineered to express human NR1H4 protein (referred to as FXR). Repor...
Ligand InfoPC cidPC sid
In DepthDetails US Patent