BDBM304721 3-(7-methoxy-1-methyl-1H-benzo[d][1,2,3]triazol-5-yl)-3-(4-methyl-3-((4-methyl-1,1-dioxido-3,4-dihydro-2H-benzo[b][1,4,5]oxathiazepin-2-yl)methyl)phenyl)propanoic acid::US10144731, Example 5
SMILES COc1cc(cc2nnn(C)c12)C(CC(O)=O)c1ccc(C)c(CN2CC(C)Oc3ccccc3S2(=O)=O)c1
InChI Key InChIKey=ZDNGJXBUEQNFBQ-UHFFFAOYSA-N
Data  2 IC50  2 EC50
PDB links: 1 PDB ID matches this monomer.
  Tab Delimited (TSV)   2D SDfile   Computed 3D by Vconf -m prep SDfile
Find this compound or compounds like it in BindingDB:
Activity Spreadsheet -- Enzyme Inhibition Constant Data from BindingDB
Found 4 hits for monomerid = 304721
TargetNuclear factor erythroid 2-related factor 2(Homo sapiens (Human))
Glaxosmithkline
US Patent
LigandPNGBDBM304721(3-(7-methoxy-1-methyl-1H-benzo[d][1,2,3]triazol-5-...)
Affinity DataEC50:  550nM. Assay description: NAD(P)H:quinone oxidoreductase 1 (NQO1), also called DT diaphorase, is a homodimeric FAD-containing enzyme that catalyzes obligatory NAD(P)H-dependen...
Ligand InfoPC cidPC sidPDB
In DepthDetails US Patent
TargetNuclear factor erythroid 2-related factor 2(Homo sapiens (Human))
Glaxosmithkline
US Patent
LigandPNGBDBM304721(3-(7-methoxy-1-methyl-1H-benzo[d][1,2,3]triazol-5-...)
Affinity DataEC50:  30nM. Assay description: Activation of Nrf2 in human BEAS2B cells assessed as increase in NQO1 enzymatic activity measured after 48 hrs by MTT assay
Ligand InfoPC cidPC sidPDB
In DepthDetails ArticlePubMed
TargetKelch-like ECH-associated protein 1(Homo sapiens (Human))
Astex Pharmaceuticals
Curated by ChEMBL
LigandPNGBDBM304721(3-(7-methoxy-1-methyl-1H-benzo[d][1,2,3]triazol-5-...)
Affinity DataIC50:  20nM. Assay description: Displacement of 5'-TAMRA-labelled NRF2 peptide from human N-terminal His6-tagged KEAP1 Kelch domain (321 to 609 residues) expressed in baculovirus in...
Ligand InfoPC cidPC sidPDB
TargetKelch-like ECH-associated protein 1 [321-609](Homo sapiens (Human))
Glaxosmithkline
US Patent
LigandPNGBDBM304721(3-(7-methoxy-1-methyl-1H-benzo[d][1,2,3]triazol-5-...)
Affinity DataIC50:  55nM. Assay description: 100 nL of 100× compound dose response curves (serial 3-fold dilutions) in DMSO are stamped using an Echo liquid handling system (Labcyte) into 384-we...
Ligand InfoPC cidPC sidPDB