BDBM304857 6-Methoxy-3-(4-methyl-3-(((R)-4-methyl-1,1-dioxido-3,4-dihydro-2H-benzo[b][1,4,5]oxathiazepin-2-yl)methyl)phenyl)hexanoic acid::US10144731, Example 165
SMILES COCCCC(CC(O)=O)c1ccc(C)c(CN2C[C@@H](C)Oc3ccccc3S2(=O)=O)c1
InChI Key InChIKey=UGALCWYPMZIMJQ-MRTLOADZSA-N
Data  1 IC50  1 EC50
  Tab Delimited (TSV)   2D SDfile   Computed 3D by Vconf -m prep SDfile
Find this compound or compounds like it in BindingDB:
Activity Spreadsheet -- Enzyme Inhibition Constant Data from BindingDB
Found 2 hits for monomerid = 304857
TargetKelch-like ECH-associated protein 1 [321-609](Homo sapiens (Human))
Glaxosmithkline
US Patent
LigandPNGBDBM304857(6-Methoxy-3-(4-methyl-3-(((R)-4-methyl-1,1-dioxido...)
Affinity DataIC50:  550nM. Assay description: 100 nL of 100× compound dose response curves (serial 3-fold dilutions) in DMSO are stamped using an Echo liquid handling system (Labcyte) into 384-we...
Ligand InfoPC cidPC sid
In DepthDetails US Patent
TargetNuclear factor erythroid 2-related factor 2(Homo sapiens (Human))
Glaxosmithkline
US Patent
LigandPNGBDBM304857(6-Methoxy-3-(4-methyl-3-(((R)-4-methyl-1,1-dioxido...)
Affinity DataEC50:  5.50E+4nM. Assay description: NAD(P)H:quinone oxidoreductase 1 (NQO1), also called DT diaphorase, is a homodimeric FAD-containing enzyme that catalyzes obligatory NAD(P)H-dependen...
Ligand InfoPC cidPC sid
In DepthDetails US Patent