BDBM304867 3-(3-(((R)-8-Chloro-4-methyl-1,1-dioxido-3,4-dihydro-2H-benzo[b][1,4,5]oxathiazepin-2-yl)methyl)-4-methylphenyl)-3-(1-methyl-1H-benzo[d][1,2,3]triazol-5-yl)propanoic acid::US10144731, Example 175
SMILES C[C@@H]1CN(Cc2cc(ccc2C)C(CC(O)=O)c2ccc3n(C)nnc3c2)S(=O)(=O)c2cc(Cl)ccc2O1
InChI Key InChIKey=JSKSTRUXUJHPPP-PLEWWHCXSA-N
Data  1 IC50  1 EC50
  Tab Delimited (TSV)   2D SDfile   Computed 3D by Vconf -m prep SDfile
Find this compound or compounds like it in BindingDB:
Activity Spreadsheet -- Enzyme Inhibition Constant Data from BindingDB
Found 2 hits for monomerid = 304867
TargetKelch-like ECH-associated protein 1 [321-609](Homo sapiens (Human))
Glaxosmithkline
US Patent
LigandPNGBDBM304867(3-(3-(((R)-8-Chloro-4-methyl-1,1-dioxido-3,4-dihyd...)
Affinity DataIC50:  55nM. Assay description: 100 nL of 100× compound dose response curves (serial 3-fold dilutions) in DMSO are stamped using an Echo liquid handling system (Labcyte) into 384-we...
Ligand InfoPC cidPC sid
In DepthDetails US Patent
TargetNuclear factor erythroid 2-related factor 2(Homo sapiens (Human))
Glaxosmithkline
US Patent
LigandPNGBDBM304867(3-(3-(((R)-8-Chloro-4-methyl-1,1-dioxido-3,4-dihyd...)
Affinity DataEC50:  55nM. Assay description: NAD(P)H:quinone oxidoreductase 1 (NQO1), also called DT diaphorase, is a homodimeric FAD-containing enzyme that catalyzes obligatory NAD(P)H-dependen...
Ligand InfoPC cidPC sid
In DepthDetails US Patent