BDBM304874 3-(1,4-Dimethyl-1H-benzo[d][1,2,3]triazol-5-yl)-3-(3-((2,2-dioxidohexahydro-1H-benzo[d][1,2]thiazin-3(4H)-yl)methyl)-4-methylphenyl)propanoic acid::US10144731, Example 182
SMILES Cc1ccc(cc1CN1CC2CCCCC2CS1(=O)=O)C(CC(O)=O)c1ccc2n(C)nnc2c1C
InChI Key InChIKey=RXICIKJEPOJGIF-UHFFFAOYSA-N
Data  1 IC50  1 EC50
  Tab Delimited (TSV)   2D SDfile   Computed 3D by Vconf -m prep SDfile
Find this compound or compounds like it in BindingDB:
Activity Spreadsheet -- Enzyme Inhibition Constant Data from BindingDB
Found 2 hits for monomerid = 304874
TargetKelch-like ECH-associated protein 1 [321-609](Homo sapiens (Human))
Glaxosmithkline
US Patent
LigandPNGBDBM304874(3-(1,4-Dimethyl-1H-benzo[d][1,2,3]triazol-5-yl)-3-...)
Affinity DataIC50:  55nM. Assay description: 100 nL of 100× compound dose response curves (serial 3-fold dilutions) in DMSO are stamped using an Echo liquid handling system (Labcyte) into 384-we...
Ligand InfoPC cidPC sid
In DepthDetails US Patent
TargetNuclear factor erythroid 2-related factor 2(Homo sapiens (Human))
Glaxosmithkline
US Patent
LigandPNGBDBM304874(3-(1,4-Dimethyl-1H-benzo[d][1,2,3]triazol-5-yl)-3-...)
Affinity DataEC50:  55nM. Assay description: NAD(P)H:quinone oxidoreductase 1 (NQO1), also called DT diaphorase, is a homodimeric FAD-containing enzyme that catalyzes obligatory NAD(P)H-dependen...
Ligand InfoPC cidPC sid
In DepthDetails US Patent