BDBM304881 US10144731, Example 189M1::US10144731, Example 189N1
SMILES CC(C(c1ccc(C)c(CN2CCN(C)c3ccccc3S2(=O)=O)c1)c1ccc2n(C)nnc2c1C)C(O)=O
InChI Key InChIKey=GFARMNLPSPHGIR-UHFFFAOYSA-N
Data  2 IC50  2 EC50
  Tab Delimited (TSV)   2D SDfile   Computed 3D by Vconf -m prep SDfile
Find this compound or compounds like it in BindingDB:
Activity Spreadsheet -- Enzyme Inhibition Constant Data from BindingDB
Found 4 hits for monomerid = 304881
TargetNuclear factor erythroid 2-related factor 2(Homo sapiens (Human))
Glaxosmithkline
US Patent
LigandPNGBDBM304881(US10144731, Example 189M1 | US10144731, Example 18...)
Affinity DataEC50:  5.50E+3nM. Assay description: NAD(P)H:quinone oxidoreductase 1 (NQO1), also called DT diaphorase, is a homodimeric FAD-containing enzyme that catalyzes obligatory NAD(P)H-dependen...
Ligand InfoPC cidPC sid
In DepthDetails US Patent
TargetKelch-like ECH-associated protein 1 [321-609](Homo sapiens (Human))
Glaxosmithkline
US Patent
LigandPNGBDBM304881(US10144731, Example 189M1 | US10144731, Example 18...)
Affinity DataIC50:  55nM. Assay description: 100 nL of 100× compound dose response curves (serial 3-fold dilutions) in DMSO are stamped using an Echo liquid handling system (Labcyte) into 384-we...
Ligand InfoPC cidPC sid
In DepthDetails US Patent
TargetKelch-like ECH-associated protein 1 [321-609](Homo sapiens (Human))
Glaxosmithkline
US Patent
LigandPNGBDBM304881(US10144731, Example 189M1 | US10144731, Example 18...)
Affinity DataIC50:  55nM. Assay description: 100 nL of 100× compound dose response curves (serial 3-fold dilutions) in DMSO are stamped using an Echo liquid handling system (Labcyte) into 384-we...
Ligand InfoPC cidPC sid
In DepthDetails US Patent
TargetNuclear factor erythroid 2-related factor 2(Homo sapiens (Human))
Glaxosmithkline
US Patent
LigandPNGBDBM304881(US10144731, Example 189M1 | US10144731, Example 18...)
Affinity DataEC50:  550nM. Assay description: NAD(P)H:quinone oxidoreductase 1 (NQO1), also called DT diaphorase, is a homodimeric FAD-containing enzyme that catalyzes obligatory NAD(P)H-dependen...
Ligand InfoPC cidPC sid
In DepthDetails US Patent