BDBM304897 3-(3-(((R)-4-Ethyl-1,1-dioxido-3,4-dihydro-2H-benzo[b][1,4,5]oxathiazepin-2-yl)methyl)-4-methylphenyl)-5-(1-propyl-1H-1,2,3-triazol-4-yl)pentanoic acid::US10144731, Example 202
SMILES CCCn1cc(CCC(CC(O)=O)c2ccc(C)c(CN3C[C@@H](CC)Oc4ccccc4S3(=O)=O)c2)nn1
InChI Key InChIKey=FGASSPDBSDOEPX-NRWPOFLRSA-N
Data  1 IC50  1 EC50
  Tab Delimited (TSV)   2D SDfile   Computed 3D by Vconf -m prep SDfile
Find this compound or compounds like it in BindingDB:
Activity Spreadsheet -- Enzyme Inhibition Constant Data from BindingDB
Found 2 hits for monomerid = 304897
TargetKelch-like ECH-associated protein 1 [321-609](Homo sapiens (Human))
Glaxosmithkline
US Patent
LigandPNGBDBM304897(3-(3-(((R)-4-Ethyl-1,1-dioxido-3,4-dihydro-2H-benz...)
Affinity DataIC50:  55nM. Assay description: 100 nL of 100× compound dose response curves (serial 3-fold dilutions) in DMSO are stamped using an Echo liquid handling system (Labcyte) into 384-we...
Ligand InfoPC cidPC sid
In DepthDetails US Patent
TargetNuclear factor erythroid 2-related factor 2(Homo sapiens (Human))
Glaxosmithkline
US Patent
LigandPNGBDBM304897(3-(3-(((R)-4-Ethyl-1,1-dioxido-3,4-dihydro-2H-benz...)
Affinity DataEC50:  55nM. Assay description: NAD(P)H:quinone oxidoreductase 1 (NQO1), also called DT diaphorase, is a homodimeric FAD-containing enzyme that catalyzes obligatory NAD(P)H-dependen...
Ligand InfoPC cidPC sid
In DepthDetails US Patent