BDBM304918 5-(1-Ethyl-1H-1,2,3-triazol-4-yl)-3-(4-methyl-3-(((S)-4-methyl-1,1-dioxido-4,5-dihydrobenzo[f][1,2]thiazepin-2(3H)-yl)methyl)phenyl)pentanoic acid::US10144731, Example 222
SMILES CCn1cc(CCC(CC(O)=O)c2ccc(C)c(CN3C[C@@H](C)Cc4ccccc4S3(=O)=O)c2)nn1
InChI Key InChIKey=NZGGZISVMMEMJX-YDNXMHBPSA-N
Data  1 IC50  1 EC50
  Tab Delimited (TSV)   2D SDfile   Computed 3D by Vconf -m prep SDfile
Find this compound or compounds like it in BindingDB:
Activity Spreadsheet -- Enzyme Inhibition Constant Data from BindingDB
Found 2 hits for monomerid = 304918
TargetKelch-like ECH-associated protein 1 [321-609](Homo sapiens (Human))
Glaxosmithkline
US Patent
LigandPNGBDBM304918(5-(1-Ethyl-1H-1,2,3-triazol-4-yl)-3-(4-methyl-3-((...)
Affinity DataIC50:  55nM. Assay description: 100 nL of 100× compound dose response curves (serial 3-fold dilutions) in DMSO are stamped using an Echo liquid handling system (Labcyte) into 384-we...
Ligand InfoPC cidPC sid
In DepthDetails US Patent
TargetNuclear factor erythroid 2-related factor 2(Homo sapiens (Human))
Glaxosmithkline
US Patent
LigandPNGBDBM304918(5-(1-Ethyl-1H-1,2,3-triazol-4-yl)-3-(4-methyl-3-((...)
Affinity DataEC50:  55nM. Assay description: NAD(P)H:quinone oxidoreductase 1 (NQO1), also called DT diaphorase, is a homodimeric FAD-containing enzyme that catalyzes obligatory NAD(P)H-dependen...
Ligand InfoPC cidPC sid
In DepthDetails US Patent