BDBM30495 1,1-dioxoisothiazole analog., 39
SMILES CC(C)(C)CCN1[C@H](C(=O)C(C1=O)=C1NS(=O)(=O)c2c1cccc2CNS(C)(=O)=O)C(C)(C)C
InChI Key InChIKey=CSYYAJRPNZRMTC-HXUWFJFHSA-N
Data  1 IC50  1 EC50
  Tab Delimited (TSV)   2D SDfile   Computed 3D by Vconf -m prep SDfile
Find this compound or compounds like it in BindingDB:
Activity Spreadsheet -- Enzyme Inhibition Constant Data from BindingDB
Found 1 hit for monomerid = 30495
TargetGenome polyprotein(Hepatitis C virus genotype 1b (isolate BK) (HCV))
Anadys Pharmaceuticals
LigandPNGBDBM30495(1,1-dioxoisothiazole analog., 39)
Affinity DataIC50:  18nM EC50:  350nMpH: 7.5 T: 2°C. Assay description: Assays were performed in a 96-well streptavidin-coated Flash-Plate using enzyme, RNA substrate, and [alpha-33P]GTP/GTP with inhibitor concentration v...
In DepthDetails ArticlePubMed