BDBM304961 2-{4,32-Dimethyl-30,30-dioxo-23-oxa-30λ6-thia-1,14,15,16-tetraazahexacyclo[20.8.1.13,7.19,13.012,16.024,29]tritriaconta-3,5,7(33),9,11,13(32),14,24(29),25,27-decaen-8-yl}acetic acid::US10144731, Example 265
SMILES Cc1ccc2cc1CN1CC(CCCCCn3nnc4c(C)c(ccc34)C2CC(O)=O)Oc2ccccc2S1(=O)=O
InChI Key InChIKey=FEAUSMUUPSCPKO-UHFFFAOYSA-N
Data  1 IC50  1 EC50
  Tab Delimited (TSV)   2D SDfile   Computed 3D by Vconf -m prep SDfile
Find this compound or compounds like it in BindingDB:
Activity Spreadsheet -- Enzyme Inhibition Constant Data from BindingDB
Found 2 hits for monomerid = 304961
TargetKelch-like ECH-associated protein 1 [321-609](Homo sapiens (Human))
Glaxosmithkline
US Patent
LigandPNGBDBM304961(2-{4,32-Dimethyl-30,30-dioxo-23-oxa-30λ6-thia...)
Affinity DataIC50:  55nM. Assay description: 100 nL of 100× compound dose response curves (serial 3-fold dilutions) in DMSO are stamped using an Echo liquid handling system (Labcyte) into 384-we...
Ligand InfoPC cidPC sid
In DepthDetails US Patent
TargetNuclear factor erythroid 2-related factor 2(Homo sapiens (Human))
Glaxosmithkline
US Patent
LigandPNGBDBM304961(2-{4,32-Dimethyl-30,30-dioxo-23-oxa-30λ6-thia...)
Affinity DataEC50:  550nM. Assay description: NAD(P)H:quinone oxidoreductase 1 (NQO1), also called DT diaphorase, is a homodimeric FAD-containing enzyme that catalyzes obligatory NAD(P)H-dependen...
Ligand InfoPC cidPC sid
In DepthDetails US Patent